Reaction Details
TargetPotassium voltage-gated channel subfamily H member 2
LigandBDBM78577
Substrate/Competitorn/a
Meas. Tech.ChEMBL_556369 (CHEMBL954102)
IC50 549.54±n/a nM
Citation Jia, LSun, H Support vector machines classification of hERG liabilities based on atom types. Bioorg Med Chem16:6252-60 (2008) 
 
Potassium voltage-gated channel subfamily H member 2
Name:Potassium voltage-gated channel subfamily H member 2
Type:Multi-pass membrane protein
Mol. Mass.:126672.65
Organism:Homo sapiens (Human)
Description:Q12809
Residue:1159
BDBM78577
NameBDBM78577
Synonyms:BEPRIDIL HYDROCHLORIDE MLS000028456 N-[3-(2-methylpropoxy)-2-pyrrolidin-1-yl-propyl]-N-(phenylmethyl)aniline;hydrochloride SMR000058419 cid_50088
TypeSmall organic molecule
Emp. Form.C24H34N2O
Mol. Mass.366.5396
SMILESCC(C)COCC(CN(Cc1ccccc1)c1ccccc1)N1CCCC1