Reaction Details
TargetMuscarinic acetylcholine receptor M5
LigandBDBM50412184
Substrate/Competitorn/a
Meas. Tech.ChEMBL_556681 (CHEMBL958968)
Ki 30.2±n/a nM
Citation Dei, SBellucci, CBuccioni, MFerraroni, MGuandalini, LManetti, DMarucci, GMatucci, RNesi, MRomanelli, MNScapecchi, STeodori, E Muscarinic antagonists with multiple stereocenters: Synthesis, affinity profile and functional activity of isomeric 1-methyl-2-(2,2-alkylaryl-1,3-oxathiolan-5-yl)pyrrolidine sulfoxide derivatives. Bioorg Med Chem16:5490-500 (2008) 
 
Muscarinic acetylcholine receptor M5
Name:Muscarinic acetylcholine receptor M5
Type:PROTEIN
Mol. Mass.:60102.35
Organism:Homo sapiens (Human)
Description:ChEMBL_1517990
Residue:532
BDBM50412184
NameBDBM50412184
Synonyms:CHEMBL539373
TypeSmall organic molecule
Emp. Form.C21H26NO2S
Mol. Mass.356.501
SMILESC[N+]1(C)CCC[C@H]1[C@H]1CS(=O)C(O1)(c1ccccc1)c1ccccc1