Reaction Details
TargetMuscarinic acetylcholine receptor M1
LigandBDBM50412185
Substrate/Competitorn/a
Meas. Tech.ChEMBL_556677 (CHEMBL958964)
Ki 323±n/a nM
Citation Dei, SBellucci, CBuccioni, MFerraroni, MGuandalini, LManetti, DMarucci, GMatucci, RNesi, MRomanelli, MNScapecchi, STeodori, E Muscarinic antagonists with multiple stereocenters: Synthesis, affinity profile and functional activity of isomeric 1-methyl-2-(2,2-alkylaryl-1,3-oxathiolan-5-yl)pyrrolidine sulfoxide derivatives. Bioorg Med Chem16:5490-500 (2008) 
 
Muscarinic acetylcholine receptor M1
Name:Muscarinic acetylcholine receptor M1
Type:Protein
Mol. Mass.:51442.54
Organism:Homo sapiens (Human)
Description:P11229
Residue:460
BDBM50412185
NameBDBM50412185
Synonyms:CHEMBL556390
TypeSmall organic molecule
Emp. Form.C21H26NO2S
Mol. Mass.356.501
SMILESC[N+]1(C)CCC[C@@H]1[C@@H]1CS(=O)C(O1)(c1ccccc1)c1ccccc1