Reaction Details
TargetHistidine-rich protein PFHRP-II
LigandBDBM22985
Substrate/Competitorn/a
Meas. Tech.ChEMBL_549674 (CHEMBL997303)
IC50 2560000000±n/a nM
Citation Van Miert, SHostyn, SMaes, BUCimanga, KBrun, RKaiser, MMátyus, PDommisse, RLemière, GVlietinck, APieters, L Isoneocryptolepine, a synthetic indoloquinoline alkaloid, as an antiplasmodial lead compound. J Nat Prod68:674-7 (2005) 
 
Histidine-rich protein PFHRP-II
Name:Histidine-rich protein PFHRP-II
Type:PROTEIN
Mol. Mass.:35156.49
Organism:Plasmodium falciparum
Description:ChEMBL_500704
Residue:332
BDBM22985
NameBDBM22985
Synonyms:Aralen CHLOROQUINE PHOSPHATE Chloroquine med.21724, Compound 8 | {4-[(7-chloroquinolin-4-yl)amino]pentyl}diethylamine
TypeAntimalarial
Emp. Form.C18H26ClN3
Mol. Mass.319.872
SMILESCCN(CC)CCCC(C)Nc1ccnc2cc(Cl)ccc12