Reaction Details
TargetProstaglandin E2 receptor EP1 subtype
LigandBDBM50412230
Substrate/Competitorn/a
Meas. Tech.ChEMBL_487568 (CHEMBL1022751)
IC50 12.59±n/a nM
Citation Hall, ABillinton, ABristow, AKBrown, SHChowdhury, ACutler, LGiblin, GMGoldsmith, PHayhow, TGKilford, IRNaylor, APassingham, BRawlings, DA Discovery of brain penetrant, soluble, pyrazole amide EP1 receptor antagonists. Bioorg Med Chem Lett18:4027-32 (2008) 
 
Prostaglandin E2 receptor EP1 subtype
Name:Prostaglandin E2 receptor EP1 subtype
Type:Enzyme
Mol. Mass.:41834.57
Organism:Homo sapiens (Human)
Description:P34995
Residue:402
BDBM50412230
NameBDBM50412230
Synonyms:CHEMBL480790
TypeSmall organic molecule
Emp. Form.C28H29ClN4O2
Mol. Mass.489.008
SMILESCCNCc1ccc(NC(=O)c2cc(C)n(Cc3cc(Cl)ccc3OCc3ccccc3)n2)cc1