Reaction Details
TargetProstaglandin E2 receptor EP1 subtype
LigandBDBM50412215
Substrate/Competitorn/a
Meas. Tech.ChEMBL_487569 (CHEMBL1022752)
Ki 158.49±n/a nM
Citation Hall, ABillinton, ABristow, AKBrown, SHChowdhury, ACutler, LGiblin, GMGoldsmith, PHayhow, TGKilford, IRNaylor, APassingham, BRawlings, DA Discovery of brain penetrant, soluble, pyrazole amide EP1 receptor antagonists. Bioorg Med Chem Lett18:4027-32 (2008) 
 
Prostaglandin E2 receptor EP1 subtype
Name:Prostaglandin E2 receptor EP1 subtype
Type:Enzyme
Mol. Mass.:41834.57
Organism:Homo sapiens (Human)
Description:P34995
Residue:402
BDBM50412215
NameBDBM50412215
Synonyms:CHEMBL481870
TypeSmall organic molecule
Emp. Form.C25H31ClN4O2
Mol. Mass.454.992
SMILESCCNCc1ccc(cc1)C(=O)Nc1cc(C)n(Cc2cc(Cl)ccc2OCC(C)C)n1