Reaction Details
TargetAlpha-2A adrenergic receptor
LigandBDBM50412244
Substrate/Competitorn/a
Meas. Tech.ChEMBL_487919 (CHEMBL1015738)
EC50 63±n/a nM
Citation Gentili, FCardinaletti, CVesprini, CCarrieri, AGhelfi, FFarande, AGiannella, MPiergentili, AQuaglia, WLaurila, JMHuhtinen, AScheinin, MPigini, M Alpha2-adrenoreceptors profile modulation. 4. From antagonist to agonist behavior. J Med Chem51:4289-99 (2008) 
 
Alpha-2A adrenergic receptor
Name:Alpha-2A adrenergic receptor
Type:Enzyme
Mol. Mass.:48979.91
Organism:Homo sapiens (Human)
Description:P08913
Residue:450
BDBM50412244
NameBDBM50412244
Synonyms:CHEMBL495096
TypeSmall organic molecule
Emp. Form.C16H22N2O
Mol. Mass.258.3587
SMILESCC(Oc1ccccc1C1CCCC1)C1=NCCN1