Reaction Details
TargetAlpha-2A adrenergic receptor
LigandBDBM50412250
Substrate/Competitorn/a
Meas. Tech.ChEMBL_487917 (CHEMBL1015736)
Ki 48±n/a nM
Citation Gentili, FCardinaletti, CVesprini, CCarrieri, AGhelfi, FFarande, AGiannella, MPiergentili, AQuaglia, WLaurila, JMHuhtinen, AScheinin, MPigini, M Alpha2-adrenoreceptors profile modulation. 4. From antagonist to agonist behavior. J Med Chem51:4289-99 (2008) 
 
Alpha-2A adrenergic receptor
Name:Alpha-2A adrenergic receptor
Type:Enzyme
Mol. Mass.:48979.91
Organism:Homo sapiens (Human)
Description:P08913
Residue:450
BDBM50412250
NameBDBM50412250
Synonyms:CHEMBL128168
TypeSmall organic molecule
Emp. Form.C17H18N2O
Mol. Mass.266.3376
SMILESCC(Oc1ccccc1-c1ccccc1)C1=NCCN1