Reaction Details
TargetAlpha-2B adrenergic receptor
LigandBDBM50412251
Substrate/Competitorn/a
Meas. Tech.ChEMBL_487921 (CHEMBL1016575)
Ki 48±n/a nM
Citation Gentili, FCardinaletti, CVesprini, CCarrieri, AGhelfi, FFarande, AGiannella, MPiergentili, AQuaglia, WLaurila, JMHuhtinen, AScheinin, MPigini, M Alpha2-adrenoreceptors profile modulation. 4. From antagonist to agonist behavior. J Med Chem51:4289-99 (2008) 
 
Alpha-2B adrenergic receptor
Name:Alpha-2B adrenergic receptor
Type:Enzyme
Mol. Mass.:49964.20
Organism:Homo sapiens (Human)
Description:P18089
Residue:450
BDBM50412251
NameBDBM50412251
Synonyms:CHEMBL494885
TypeSmall organic molecule
Emp. Form.C16H16N2O
Mol. Mass.252.311
SMILESC1CN=C(N1)C(Oc1ccccc1)c1ccccc1