Reaction Details
TargetMuscarinic acetylcholine receptor M1
LigandBDBM50412310
Substrate/Competitorn/a
Meas. Tech.ChEMBL_491018 (CHEMBL982066)
Ki 1445.44±n/a nM
Citation Minarini, AMarucci, GBellucci, CGiorgi, GTumiatti, VBolognesi, MLMatera, RRosini, MMelchiorre, C Design, synthesis, and biological evaluation of pirenzepine analogs bearing a 1,2-cyclohexanediamine and perhydroquinoxaline units in exchange for the piperazine ring as antimuscarinics. Bioorg Med Chem16:7311-20 (2008) 
 
Muscarinic acetylcholine receptor M1
Name:Muscarinic acetylcholine receptor M1
Type:Protein
Mol. Mass.:51442.54
Organism:Homo sapiens (Human)
Description:P11229
Residue:460
BDBM50412310
NameBDBM50412310
Synonyms:CHEMBL478227
TypeSmall organic molecule
Emp. Form.C23H27N5O2
Mol. Mass.405.4928
SMILESCN1CCN(CC(=O)N2c3ccccc3C(=O)Nc3cccnc23)[C@@H]2CCCC[C@H]12