Reaction Details
TargetMuscarinic acetylcholine receptor M2
LigandBDBM50412311
Substrate/Competitorn/a
Meas. Tech.ChEMBL_491019 (CHEMBL982067)
Ki 1000±n/a nM
Citation Minarini, AMarucci, GBellucci, CGiorgi, GTumiatti, VBolognesi, MLMatera, RRosini, MMelchiorre, C Design, synthesis, and biological evaluation of pirenzepine analogs bearing a 1,2-cyclohexanediamine and perhydroquinoxaline units in exchange for the piperazine ring as antimuscarinics. Bioorg Med Chem16:7311-20 (2008) 
 
Muscarinic acetylcholine receptor M2
Name:Muscarinic acetylcholine receptor M2
Type:GPCR
Mol. Mass.:51730.61
Organism:Homo sapiens (Human)
Description:P08172
Residue:466
BDBM50412311
NameBDBM50412311
Synonyms:CHEMBL478226
TypeSmall organic molecule
Emp. Form.C23H27N5O2
Mol. Mass.405.4928
SMILESCN1CCN(CC(=O)N2c3ccccc3C(=O)Nc3cccnc23)[C@@H]2CCCC[C@@H]12