Reaction Details
TargetMuscarinic acetylcholine receptor M3
LigandBDBM50412310
Substrate/Competitorn/a
Meas. Tech.ChEMBL_491020 (CHEMBL982068)
Ki>10000±n/a nM
Citation Minarini, AMarucci, GBellucci, CGiorgi, GTumiatti, VBolognesi, MLMatera, RRosini, MMelchiorre, C Design, synthesis, and biological evaluation of pirenzepine analogs bearing a 1,2-cyclohexanediamine and perhydroquinoxaline units in exchange for the piperazine ring as antimuscarinics. Bioorg Med Chem16:7311-20 (2008) 
 
Muscarinic acetylcholine receptor M3
Name:Muscarinic acetylcholine receptor M3
Type:Enzyme
Mol. Mass.:66151.03
Organism:Homo sapiens (Human)
Description:P20309
Residue:590
BDBM50412310
NameBDBM50412310
Synonyms:CHEMBL478227
TypeSmall organic molecule
Emp. Form.C23H27N5O2
Mol. Mass.405.4928
SMILESCN1CCN(CC(=O)N2c3ccccc3C(=O)Nc3cccnc23)[C@@H]2CCCC[C@H]12