Reaction Details
TargetCalcium-activated potassium channel subunit alpha-1
LigandBDBM50412339
Substrate/Competitorn/a
Meas. Tech.ChEMBL_510400 (CHEMBL1000350)
IC50 39.81±n/a nM
Citation Calderone, VSpogli, RMartelli, AManfroni, GTestai, LSabatini, STabarrini, OCecchetti, V Novel 1,4-benzothiazine derivatives as large conductance Ca2+-activated potassium channel openers. J Med Chem51:5085-92 (2008) 
 
Calcium-activated potassium channel subunit alpha-1
Name:Calcium-activated potassium channel subunit alpha-1
Type:PROTEIN
Mol. Mass.:134382.76
Organism:Rattus norvegicus
Description:ChEMBL_510400
Residue:1209
BDBM50412339
NameBDBM50412339
Synonyms:CHEMBL496460
TypeSmall organic molecule
Emp. Form.C16H11BrF3NO2S
Mol. Mass.418.228
SMILESCOc1ccc(Br)cc1C1Sc2ccc(cc2NC1=O)C(F)(F)F