Reaction Details
TargetMuscarinic acetylcholine receptor M1
LigandBDBM50412342
Substrate/Competitorn/a
Meas. Tech.ChEMBL_510504 (CHEMBL995212)
IC50 1995.26±n/a nM
Citation Jin, JWang, YShi, DWang, FDavis, RSJin, QFu, WFoley, JJWebb, EFDehaas, CJBerlanga, MBurman, MSarau, HMMorrow, DMRao, PKallal, LAMoore, MLRivero, RAPalovich, MSalmon, MBelmonte, KEBusch-Petersen, J Discovery of novel and long acting muscarinic acetylcholine receptor antagonists. J Med Chem51:4866-9 (2008) 
 
Muscarinic acetylcholine receptor M1
Name:Muscarinic acetylcholine receptor M1
Type:Protein
Mol. Mass.:51442.54
Organism:Homo sapiens (Human)
Description:P11229
Residue:460
BDBM50412342
NameBDBM50412342
Synonyms:CHEMBL502000
TypeSmall organic molecule
Emp. Form.C30H34N4O6
Mol. Mass.546.6142
SMILESCCOC(=O)c1ccc(NC(=O)N[C@@H](Cc2ccc(O)cc2)C(=O)N[C@@H]2CCN(Cc3ccc(O)cc3)C2)cc1