Reaction Details
TargetCytochrome P450 3A4
LigandBDBM50412340
Substrate/Competitorn/a
Meas. Tech.ChEMBL_510520 (CHEMBL996056)
IC50 10000±n/a nM
Citation Jin, JWang, YShi, DWang, FDavis, RSJin, QFu, WFoley, JJWebb, EFDehaas, CJBerlanga, MBurman, MSarau, HMMorrow, DMRao, PKallal, LAMoore, MLRivero, RAPalovich, MSalmon, MBelmonte, KEBusch-Petersen, J Discovery of novel and long acting muscarinic acetylcholine receptor antagonists. J Med Chem51:4866-9 (2008) 
 
Cytochrome P450 3A4
Name:Cytochrome P450 3A4
Type:Enzyme
Mol. Mass.:57349.57
Organism:Homo sapiens (Human)
Description:n/a
Residue:503
BDBM50412340
NameBDBM50412340
Synonyms:CHEMBL540359
TypeSmall organic molecule
Emp. Form.C33H41N4O6
Mol. Mass.589.7013
SMILESCC(C)OC(=O)c1ccc(NC(=O)N[C@@H](Cc2ccc(O)cc2)C(=O)N[C@H]2CCC[N+](C)(Cc3cccc(O)c3)C2)cc1