Reaction Details
Target3-oxoacyl-[acyl-carrier-protein] synthase 3
LigandBDBM23602
Substrate/Competitorn/a
Meas. Tech.ChEMBL_510888 (CHEMBL997780)
IC50 240.44±n/a nM
Citation Singh, SSoni, LKGupta, MKPrabhakar, YSKaskhedikar, SG QSAR studies on benzoylaminobenzoic acid derivatives as inhibitors of beta-ketoacyl-acyl carrier protein synthase III. Eur J Med Chem43:1071-80 (2008) 
 
3-oxoacyl-[acyl-carrier-protein] synthase 3
Name:3-oxoacyl-[acyl-carrier-protein] synthase 3
Type:Acyltransferase; homodimer
Mol. Mass.:35176.53
Organism:Enterococcus faecalis
Description:The E. faecalis FabH was cloned, and protein was expressed in E. coli.
Residue:321
BDBM23602
NameBDBM23602
Synonyms:(3-Phenoxybenzoylamino)benzoic acid deriv., 24l | 2-{[4-(4-fluoro-3-methylphenyl)-3-phenoxybenzene]amido}benzoic acid
TypeSmall organic molecule
Emp. Form.C27H20FNO4
Mol. Mass.441.4504
SMILESCc1cc(ccc1F)-c1ccc(cc1Oc1ccccc1)C(=O)Nc1ccccc1C(O)=O