Reaction Details
TargetcAMP-specific 3',5'-cyclic phosphodiesterase 4B
LigandBDBM50412412
Substrate/Competitorn/a
Meas. Tech.ChEMBL_492193 (CHEMBL951569)
IC50 19.95±n/a nM
Citation Hamblin, JNAngell, TDBallantine, SPCook, CMCooper, AWDawson, JDelves, CJJones, PSLindvall, MLucas, FSMitchell, CJNeu, MYRanshaw, LESolanke, YESomers, DOWiseman, JO Pyrazolopyridines as a novel structural class of potent and selective PDE4 inhibitors. Bioorg Med Chem Lett18:4237-41 (2008) 
 
cAMP-specific 3',5'-cyclic phosphodiesterase 4B
Name:cAMP-specific 3',5'-cyclic phosphodiesterase 4B
Type:Protein
Mol. Mass.:83318.87
Organism:Homo sapiens (Human)
Description:Q07343
Residue:736
BDBM50412412
NameBDBM50412412
Synonyms:CHEMBL488290
TypeSmall organic molecule
Emp. Form.C20H31N5O2
Mol. Mass.373.4924
SMILESCCC(CC)CNC(=O)c1cnc2n(CC)ncc2c1NC1CCOCC1