Reaction Details
Target5-hydroxytryptamine receptor 1D
LigandBDBM50412435
Substrate/Competitorn/a
Meas. Tech.ChEMBL_537448 (CHEMBL990613)
Ki 251.19±n/a nM
Citation Serafinowska, HTBlaney, FELovell, PJMerlo, GGScott, CMSmith, PWStarr, KRWatson, JM Novel 5-HT(1A/1B/1D) receptors antagonists with potent 5-HT reuptake inhibitory activity. Bioorg Med Chem Lett18:5581-5 (2008) 
 
5-hydroxytryptamine receptor 1D
Name:5-hydroxytryptamine receptor 1D
Type:G Protein-Coupled Receptor (GPCR)
Mol. Mass.:41920.63
Organism:Homo sapiens (Human)
Description:Receptor binding assays were performed using human clone stably expressed in CHO cells.
Residue:377
BDBM50412435
NameBDBM50412435
Synonyms:CHEMBL484216
TypeSmall organic molecule
Emp. Form.C27H31N3O3
Mol. Mass.445.5533
SMILESCC(COc1cccc2nc(C)ccc12)N1CCC(Cc2ccc3OCC(=O)Nc3c2)CC1