Reaction Details
TargetSodium-dependent serotonin transporter
LigandBDBM50412441
Substrate/Competitorn/a
Meas. Tech.ChEMBL_537449 (CHEMBL990614)
Ki 3.98±n/a nM
Citation Serafinowska, HTBlaney, FELovell, PJMerlo, GGScott, CMSmith, PWStarr, KRWatson, JM Novel 5-HT(1A/1B/1D) receptors antagonists with potent 5-HT reuptake inhibitory activity. Bioorg Med Chem Lett18:5581-5 (2008) 
 
Sodium-dependent serotonin transporter
Name:Sodium-dependent serotonin transporter
Type:Multi-pass membrane protein
Mol. Mass.:70168.43
Organism:Rattus norvegicus (rat)
Description:P31652
Residue:630
BDBM50412441
NameBDBM50412441
Synonyms:CHEMBL490417 | SB-744185
TypeSmall organic molecule
Emp. Form.C24H26N4O2
Mol. Mass.402.4888
SMILESCc1ccc2c(cccc2n1)N1CCN(CCc2ccc3OCC(=O)Nc3c2)CC1