Reaction Details
TargetSodium-dependent serotonin transporter
LigandBDBM50412434
Substrate/Competitorn/a
Meas. Tech.ChEMBL_537449 (CHEMBL990614)
Ki 6.31±n/a nM
Citation Serafinowska, HTBlaney, FELovell, PJMerlo, GGScott, CMSmith, PWStarr, KRWatson, JM Novel 5-HT(1A/1B/1D) receptors antagonists with potent 5-HT reuptake inhibitory activity. Bioorg Med Chem Lett18:5581-5 (2008) 
 
Sodium-dependent serotonin transporter
Name:Sodium-dependent serotonin transporter
Type:Multi-pass membrane protein
Mol. Mass.:70168.43
Organism:Rattus norvegicus (rat)
Description:P31652
Residue:630
BDBM50412434
NameBDBM50412434
Synonyms:CHEMBL483365
TypeSmall organic molecule
Emp. Form.C26H30N4O2
Mol. Mass.430.542
SMILESCc1ccc2c(cccc2n1)N1CCN(CCCCc2ccc3OCC(=O)Nc3c2)CC1