Reaction Details
Target5-hydroxytryptamine receptor 1B
LigandBDBM50412440
Substrate/Competitorn/a
Meas. Tech.ChEMBL_537447 (CHEMBL990612)
Ki 50.12±n/a nM
Citation Serafinowska, HTBlaney, FELovell, PJMerlo, GGScott, CMSmith, PWStarr, KRWatson, JM Novel 5-HT(1A/1B/1D) receptors antagonists with potent 5-HT reuptake inhibitory activity. Bioorg Med Chem Lett18:5581-5 (2008) 
 
5-hydroxytryptamine receptor 1B
Name:5-hydroxytryptamine receptor 1B
Type:G Protein-Coupled Receptor (GPCR)
Mol. Mass.:43579.17
Organism:Homo sapiens (Human)
Description:Receptor binding assays were performed using human clone stably expressed in CHO cells
Residue:390
BDBM50412440
NameBDBM50412440
Synonyms:CHEMBL485395
TypeSmall organic molecule
Emp. Form.C25H28N4O2
Mol. Mass.416.5154
SMILESCc1ccc2c(cccc2n1)N1CCN(CCCc2ccc3OCC(=O)Nc3c2)CC1