Reaction Details
TargetHistamine H3 receptor
LigandBDBM50412461
Substrate/Competitorn/a
Meas. Tech.ChEMBL_536770 (CHEMBL984564)
Ki 2.4±n/a nM
Citation Morini, GComini, MRivara, MRivara, SBordi, FPlazzi, PVFlammini, LSaccani, FBertoni, SBallabeni, VBarocelli, EMor, M Synthesis and structure-activity relationships for biphenyl H3 receptor antagonists with moderate anti-cholinesterase activity. Bioorg Med Chem16:9911-24 (2008) 
 
Histamine H3 receptor
Name:Histamine H3 receptor
Type:G Protein-Coupled Receptor (GPCR)
Mol. Mass.:48607.98
Organism:Rattus norvegicus (rat)
Description:n/a
Residue:445
BDBM50412461
NameBDBM50412461
Synonyms:CHEMBL457004
TypeSmall organic molecule
Emp. Form.C26H36N2
Mol. Mass.376.5774
SMILESCC1CC(C)CN(Cc2ccc(cc2)-c2ccc(CN3CCCCC3)cc2)C1