Reaction Details
TargetHistamine H3 receptor
LigandBDBM50412476
Substrate/Competitorn/a
Meas. Tech.ChEMBL_536770 (CHEMBL984564)
Ki 54.95±n/a nM
Citation Morini, GComini, MRivara, MRivara, SBordi, FPlazzi, PVFlammini, LSaccani, FBertoni, SBallabeni, VBarocelli, EMor, M Synthesis and structure-activity relationships for biphenyl H3 receptor antagonists with moderate anti-cholinesterase activity. Bioorg Med Chem16:9911-24 (2008) 
 
Histamine H3 receptor
Name:Histamine H3 receptor
Type:G Protein-Coupled Receptor (GPCR)
Mol. Mass.:48607.98
Organism:Rattus norvegicus (rat)
Description:n/a
Residue:445
BDBM50412476
NameBDBM50412476
Synonyms:CHEMBL459542
TypeSmall organic molecule
Emp. Form.C28H40N2
Mol. Mass.404.6306
SMILESCC1CCN(CCc2ccc(cc2)-c2ccc(CCN3CCC(C)CC3)cc2)CC1