Reaction Details
TargetHistamine H3 receptor
LigandBDBM50412447
Substrate/Competitorn/a
Meas. Tech.ChEMBL_536769 (CHEMBL984563)
Ki 3.39±n/a nM
Citation Morini, GComini, MRivara, MRivara, SBordi, FPlazzi, PVFlammini, LSaccani, FBertoni, SBallabeni, VBarocelli, EMor, M Synthesis and structure-activity relationships for biphenyl H3 receptor antagonists with moderate anti-cholinesterase activity. Bioorg Med Chem16:9911-24 (2008) 
 
Histamine H3 receptor
Name:Histamine H3 receptor
Type:G Protein-Coupled Receptor (GPCR)
Mol. Mass.:48691.47
Organism:Homo sapiens (Human)
Description:Binding assays were using CHO cells stably expressing hH3R receptors.
Residue:445
BDBM50412447
NameBDBM50412447
Synonyms:CHEMBL380101
TypeSmall organic molecule
Emp. Form.C24H32N2
Mol. Mass.348.5243
SMILESC(N1CCCCC1)c1ccc(cc1)-c1ccc(CN2CCCCC2)cc1