Reaction Details
TargetHistamine H3 receptor
LigandBDBM50412475
Substrate/Competitorn/a
Meas. Tech.ChEMBL_536769 (CHEMBL984563)
Ki 75.86±n/a nM
Citation Morini, GComini, MRivara, MRivara, SBordi, FPlazzi, PVFlammini, LSaccani, FBertoni, SBallabeni, VBarocelli, EMor, M Synthesis and structure-activity relationships for biphenyl H3 receptor antagonists with moderate anti-cholinesterase activity. Bioorg Med Chem16:9911-24 (2008) 
 
Histamine H3 receptor
Name:Histamine H3 receptor
Type:G Protein-Coupled Receptor (GPCR)
Mol. Mass.:48691.47
Organism:Homo sapiens (Human)
Description:Binding assays were using CHO cells stably expressing hH3R receptors.
Residue:445
BDBM50412475
NameBDBM50412475
Synonyms:CHEMBL457005
TypeSmall organic molecule
Emp. Form.C26H26N2O
Mol. Mass.382.4974
SMILESN#Cc1ccc(OCc2ccc(cc2)-c2ccc(CN3CCCCC3)cc2)cc1