Reaction Details
TargetHistamine H3 receptor
LigandBDBM50412463
Substrate/Competitorn/a
Meas. Tech.ChEMBL_536769 (CHEMBL984563)
Ki 1.74±n/a nM
Citation Morini, GComini, MRivara, MRivara, SBordi, FPlazzi, PVFlammini, LSaccani, FBertoni, SBallabeni, VBarocelli, EMor, M Synthesis and structure-activity relationships for biphenyl H3 receptor antagonists with moderate anti-cholinesterase activity. Bioorg Med Chem16:9911-24 (2008) 
 
Histamine H3 receptor
Name:Histamine H3 receptor
Type:G Protein-Coupled Receptor (GPCR)
Mol. Mass.:48691.47
Organism:Homo sapiens (Human)
Description:Binding assays were using CHO cells stably expressing hH3R receptors.
Residue:445
BDBM50412463
NameBDBM50412463
Synonyms:CHEMBL457862
TypeSmall organic molecule
Emp. Form.C25H36N2
Mol. Mass.364.5667
SMILESCCCN(CCC)Cc1ccc(cc1)-c1ccc(CN2CCCCC2)cc1