Reaction Details
TargetHistamine H3 receptor
LigandBDBM50412467
Substrate/Competitorn/a
Meas. Tech.ChEMBL_536769 (CHEMBL984563)
Ki 1.17±n/a nM
Citation Morini, GComini, MRivara, MRivara, SBordi, FPlazzi, PVFlammini, LSaccani, FBertoni, SBallabeni, VBarocelli, EMor, M Synthesis and structure-activity relationships for biphenyl H3 receptor antagonists with moderate anti-cholinesterase activity. Bioorg Med Chem16:9911-24 (2008) 
 
Histamine H3 receptor
Name:Histamine H3 receptor
Type:G Protein-Coupled Receptor (GPCR)
Mol. Mass.:48691.47
Organism:Homo sapiens (Human)
Description:Binding assays were using CHO cells stably expressing hH3R receptors.
Residue:445
BDBM50412467
NameBDBM50412467
Synonyms:CHEMBL378178
TypeSmall organic molecule
Emp. Form.C26H36N2
Mol. Mass.376.5774
SMILESC(Cc1ccc(cc1)-c1ccc(CCN2CCCCC2)cc1)N1CCCCC1