Reaction Details
TargetHistamine H1 receptor
LigandBDBM50191289
Substrate/Competitorn/a
Meas. Tech.ChEMBL_556998 (CHEMBL960689)
Ki 7.76±n/a nM
Citation Smits, RAde Esch, IJZuiderveld, OPBroeker, JSansuk, KGuaita, ECoruzzi, GAdami, MHaaksma, ELeurs, R Discovery of quinazolines as histamine H4 receptor inverse agonists using a scaffold hopping approach. J Med Chem51:7855-65 (2008) 
 
Histamine H1 receptor
Name:Histamine H1 receptor
Type:G Protein-Coupled Receptor (GPCR)
Mol. Mass.:55808.72
Organism:Homo sapiens (Human)
Description:Cell pellets from SK-N-MC cells transfected with human H1 receptor were used in binding assay.
Residue:487
BDBM50191289
NameBDBM50191289
Synonyms:7-chloro-11-(4-methyl-piperazin-1-yl)-dibenzo[b,f][1,4]oxazepine 7-chloro-11-(4-methylpiperazin-1-yl)dibenzo[b,f][1,4]oxazepine VUF-6884
TypeSmall organic molecule
Emp. Form.C18H18ClN3O
Mol. Mass.327.808
SMILESCN1CCN(CC1)C1=Nc2ccc(Cl)cc2Oc2ccccc12