Reaction Details
TargetCalcium-activated potassium channel subunit alpha-1
LigandBDBM50412638
Substrate/Competitorn/a
Meas. Tech.ChEMBL_558735 (CHEMBL954137)
IC50 691.83±n/a nM
Citation Coi, AFiamingo, FLLivi, OCalderone, VMartelli, AMassarelli, IBianucci, AM QSAR studies on BK channel activators. Bioorg Med Chem17:319-25 (2008) 
 
Calcium-activated potassium channel subunit alpha-1
Name:Calcium-activated potassium channel subunit alpha-1
Type:PROTEIN
Mol. Mass.:137567.62
Organism:Homo sapiens (Human)
Description:ChEMBL_938830
Residue:1236
BDBM50412638
NameBDBM50412638
Synonyms:CHEMBL464249 | TCMDC-124051
TypeSmall organic molecule
Emp. Form.C14H11ClN2O5
Mol. Mass.322.701
SMILESCOc1cc(ccc1NC(=O)c1cc(Cl)ccc1O)[N+]([O-])=O