Reaction Details
TargetCalcium-activated potassium channel subunit alpha-1
LigandBDBM50412639
Substrate/Competitorn/a
Meas. Tech.ChEMBL_558735 (CHEMBL954137)
IC50 1445.44±n/a nM
Citation Coi, AFiamingo, FLLivi, OCalderone, VMartelli, AMassarelli, IBianucci, AM QSAR studies on BK channel activators. Bioorg Med Chem17:319-25 (2008) 
 
Calcium-activated potassium channel subunit alpha-1
Name:Calcium-activated potassium channel subunit alpha-1
Type:PROTEIN
Mol. Mass.:137567.62
Organism:Homo sapiens (Human)
Description:ChEMBL_938830
Residue:1236
BDBM50412639
NameBDBM50412639
Synonyms:CHEMBL465109
TypeSmall organic molecule
Emp. Form.C13H10N2O5
Mol. Mass.274.2289
SMILESOc1ccccc1C(=O)Nc1ccc(cc1O)[N+]([O-])=O