Reaction Details
TargetCalcium-activated potassium channel subunit alpha-1
LigandBDBM50412675
Substrate/Competitorn/a
Meas. Tech.ChEMBL_558735 (CHEMBL954137)
IC50 12589.25±n/a nM
Citation Coi, AFiamingo, FLLivi, OCalderone, VMartelli, AMassarelli, IBianucci, AM QSAR studies on BK channel activators. Bioorg Med Chem17:319-25 (2008) 
 
Calcium-activated potassium channel subunit alpha-1
Name:Calcium-activated potassium channel subunit alpha-1
Type:PROTEIN
Mol. Mass.:137567.62
Organism:Homo sapiens (Human)
Description:ChEMBL_938830
Residue:1236
BDBM50412675
NameBDBM50412675
Synonyms:CHEMBL464033
TypeSmall organic molecule
Emp. Form.C15H15NO3
Mol. Mass.257.2845
SMILESCOc1ccccc1C(=O)Nc1cc(C)ccc1O