Reaction Details
TargetCalcium-activated potassium channel subunit alpha-1
LigandBDBM50412677
Substrate/Competitorn/a
Meas. Tech.ChEMBL_558735 (CHEMBL954137)
IC50 15135.61±n/a nM
Citation Coi, AFiamingo, FLLivi, OCalderone, VMartelli, AMassarelli, IBianucci, AM QSAR studies on BK channel activators. Bioorg Med Chem17:319-25 (2008) 
 
Calcium-activated potassium channel subunit alpha-1
Name:Calcium-activated potassium channel subunit alpha-1
Type:PROTEIN
Mol. Mass.:137567.62
Organism:Homo sapiens (Human)
Description:ChEMBL_938830
Residue:1236
BDBM50412677
NameBDBM50412677
Synonyms:CHEMBL465376
TypeSmall organic molecule
Emp. Form.C12H9ClN2O2
Mol. Mass.248.665
SMILESOc1ccc(Cl)cc1C(=O)Nc1cccnc1