Reaction Details
TargetLiver carboxylesterase 1
LigandBDBM50412690
Substrate/Competitorn/a
Meas. Tech.ChEMBL_560263 (CHEMBL1019602)
Ki 1±n/a nM
Citation Harada, TNakagawa, YWadkins, RMPotter, PMWheelock, CE Comparison of benzil and trifluoromethyl ketone (TFK)-mediated carboxylesterase inhibition using classical and 3D-quantitative structure-activity relationship analysis. Bioorg Med Chem17:149-64 (2008) 
 
Liver carboxylesterase 1
Name:Liver carboxylesterase 1
Type:Protein
Mol. Mass.:62520.83
Organism:Homo sapiens (Human)
Description:n/a
Residue:567
BDBM50412690
NameBDBM50412690
Synonyms:CHEMBL449475
TypeSmall organic molecule
Emp. Form.C9H17F3O3
Mol. Mass.230.2247
SMILESCCCCCCOCC(O)(O)C(F)(F)F