Reaction Details
TargetPotassium voltage-gated channel subfamily H member 2
LigandBDBM50412728
Substrate/Competitorn/a
Meas. Tech.ChEMBL_539037 (CHEMBL1035711)
IC50 10000±n/a nM
Citation Jin, JBudzik, BWang, YShi, DWang, FXie, HWan, ZZhu, CFoley, JJWebb, EFBerlanga, MBurman, MSarau, HMMorrow, DMMoore, MLRivero, RAPalovich, MSalmon, MBelmonte, KELainé, DI Discovery of biphenyl piperazines as novel and long acting muscarinic acetylcholine receptor antagonists. J Med Chem51:5915-8 (2008) 
 
Potassium voltage-gated channel subfamily H member 2
Name:Potassium voltage-gated channel subfamily H member 2
Type:Multi-pass membrane protein
Mol. Mass.:126672.65
Organism:Homo sapiens (Human)
Description:Q12809
Residue:1159
BDBM50412728
NameBDBM50412728
Synonyms:CHEMBL521523
TypeSmall organic molecule
Emp. Form.C32H39FN4O
Mol. Mass.514.6767
SMILESC[C@H]1CN(Cc2cccc(c2)-c2cc(CNC(=O)c3cccc(CC4CCNCC4)c3)ccc2F)CCN1