Reaction Details
TargetSalicyl-AMP ligase / salicyl-S-ArCP synthetase
LigandBDBM50412826
Substrate/Competitorn/a
Meas. Tech.ChEMBL_496141 (CHEMBL999364)
Ki 0.46±n/a nM
Citation Gupte, ABoshoff, HIWilson, DJNeres, JLabello, NPSomu, RVXing, CBarry, CEAldrich, CC Inhibition of siderophore biosynthesis by 2-triazole substituted analogues of 5'-O-[N-(salicyl)sulfamoyl]adenosine: antibacterial nucleosides effective against Mycobacterium tuberculosis. J Med Chem51:7495-507 (2009) 
 
Salicyl-AMP ligase / salicyl-S-ArCP synthetase
Name:Salicyl-AMP ligase / salicyl-S-ArCP synthetase
Type:PROTEIN
Mol. Mass.:59275.32
Organism:Mycobacterium tuberculosis
Description:ChEMBL_423930
Residue:565
BDBM50412826
NameBDBM50412826
Synonyms:CHEMBL612048
TypeSmall organic molecule
Emp. Form.C22H23N9O8S
Mol. Mass.573.539
SMILESNc1nc(nc2n(cnc12)C1OC(COS(=O)(=O)NC(=O)c2ccccc2O)C(O)C1O)-n1cc(nn1)C1CC1