Reaction Details
TargetSalicyl-AMP ligase / salicyl-S-ArCP synthetase
LigandBDBM50412837
Substrate/Competitorn/a
Meas. Tech.ChEMBL_496141 (CHEMBL999364)
Ki 3.2±n/a nM
Citation Gupte, ABoshoff, HIWilson, DJNeres, JLabello, NPSomu, RVXing, CBarry, CEAldrich, CC Inhibition of siderophore biosynthesis by 2-triazole substituted analogues of 5'-O-[N-(salicyl)sulfamoyl]adenosine: antibacterial nucleosides effective against Mycobacterium tuberculosis. J Med Chem51:7495-507 (2009) 
 
Salicyl-AMP ligase / salicyl-S-ArCP synthetase
Name:Salicyl-AMP ligase / salicyl-S-ArCP synthetase
Type:PROTEIN
Mol. Mass.:59275.32
Organism:Mycobacterium tuberculosis
Description:ChEMBL_423930
Residue:565
BDBM50412837
NameBDBM50412837
Synonyms:CHEMBL609103
TypeSmall organic molecule
Emp. Form.C22H23N9O10S
Mol. Mass.605.537
SMILESCCOC(=O)c1cn(nn1)-c1nc(N)c2ncn(C3OC(COS(=O)(=O)NC(=O)c4ccccc4O)C(O)C3O)c2n1