Reaction Details
TargetLanosterol synthase
LigandBDBM50128072
Substrate/Competitorn/a
Meas. Tech.ChEMBL_519215 (CHEMBL946654)
IC50 6.46±n/a nM
Citation Ermondi, GCaron, G GRIND-based 3D-QSAR to predict inhibitory activity for similar enzymes, OSC and SHC. Eur J Med Chem43:1462-8 (2008) 
 
Lanosterol synthase
Name:Lanosterol synthase
Type:PROTEIN
Mol. Mass.:83309.32
Organism:Homo sapiens (Human)
Description:ChEMBL_11231
Residue:732
BDBM50128072
NameBDBM50128072
Synonyms:(4-{2-[(Allyl-cyclopropyl-amino)-methyl]-cyclopropylmethoxy}-phenyl)-(4-bromo-phenyl)-methanone N-allyl-N-(((1S,2S)-2-((4-(4-bromobenzoyl)phenoxy)methyl)cyclopropyl)methyl)cyclopropanaminium | {4-[((1S,2S)-2-{[ALLYL(CYCLOPROPYL)AMINO]METHYL}CYCLOPROPYL)METHOXY]PHENYL}(4-BROMOPHENYL)METHANONE
TypeSmall organic molecule
Emp. Form.C24H26BrNO2
Mol. Mass.440.373
SMILESBrc1ccc(cc1)C(=O)c1ccc(OC[C@H]2C[C@@H]2CN(CC=C)C2CC2)cc1