Reaction Details
TargetLanosterol synthase
LigandBDBM50128063
Substrate/Competitorn/a
Meas. Tech.ChEMBL_519215 (CHEMBL946654)
IC50 2.88±n/a nM
Citation Ermondi, GCaron, G GRIND-based 3D-QSAR to predict inhibitory activity for similar enzymes, OSC and SHC. Eur J Med Chem43:1462-8 (2008) 
 
Lanosterol synthase
Name:Lanosterol synthase
Type:PROTEIN
Mol. Mass.:83309.32
Organism:Homo sapiens (Human)
Description:ChEMBL_11231
Residue:732
BDBM50128063
NameBDBM50128063
Synonyms:Allyl-{6-[3-(4-bromo-phenyl)-benzo[d]isothiazol-6-yloxy]-hexyl}-methyl-amine CHEMBL67133 N-allyl-6-(3-(4-bromophenyl)benzo[d]isothiazol-6-yloxy)-N-methylhexan-1-aminium
TypeSmall organic molecule
Emp. Form.C23H27BrN2OS
Mol. Mass.459.442
SMILESCN(CCCCCCOc1ccc2c(nsc2c1)-c1ccc(Br)cc1)CC=C