Reaction Details
TargetNeuromedin-K receptor
LigandBDBM50412949
Substrate/Competitorn/a
Meas. Tech.ChEMBL_515484 (CHEMBL992211)
Ki 6.31±n/a nM
Citation Smith, PWWyman, PALovell, PGoodacre, CSerafinowska, HTVong, AHarrington, FFlynn, SBradley, DMPorter, RCoggon, SMurkitt, GSearle, KThomas, DRWatson, JMMartin, WWu, ZDawson, LA New quinoline NK3 receptor antagonists with CNS activity. Bioorg Med Chem Lett19:837-40 (2009) 
 
Neuromedin-K receptor
Name:Neuromedin-K receptor
Type:Enzyme
Mol. Mass.:52221.96
Organism:Homo sapiens (Human)
Description:P29371
Residue:465
BDBM50412949
NameBDBM50412949
Synonyms:CHEMBL519790
TypeSmall organic molecule
Emp. Form.C26H21F2N3O
Mol. Mass.429.4612
SMILESNc1c(nc2ccccc2c1C(=O)N[C@@H](C1CC1)c1cccc(F)c1)-c1cccc(F)c1