Reaction Details
Target5-hydroxytryptamine receptor 1B
LigandBDBM50412983
Substrate/Competitorn/a
Meas. Tech.ChEMBL_516611 (CHEMBL991387)
Ki 525±n/a nM
Citation Wroblowski, BWigglesworth, MJSzekeres, PGSmith, GDRahman, SSNicholson, NHMuir, AIHall, AHeer, JPGarland, SLCoates, WJ The discovery of a selective, small molecule agonist for the MAS-related gene X1 receptor. J Med Chem52:818-25 (2009) 
 
5-hydroxytryptamine receptor 1B
Name:5-hydroxytryptamine receptor 1B
Type:G Protein-Coupled Receptor (GPCR)
Mol. Mass.:43579.17
Organism:Homo sapiens (Human)
Description:Receptor binding assays were performed using human clone stably expressed in CHO cells
Residue:390
BDBM50412983
NameBDBM50412983
Synonyms:CHEMBL458001
TypeSmall organic molecule
Emp. Form.C28H26ClN5O2
Mol. Mass.499.991
SMILESClc1c(cnn(Cc2cccc(NC(=O)c3ccc(cc3)-c3ccccc3)c2)c1=O)N1CCNCC1