Reaction Details
Target5-hydroxytryptamine receptor 1B
LigandBDBM50412984
Substrate/Competitorn/a
Meas. Tech.ChEMBL_516611 (CHEMBL991387)
Ki 776±n/a nM
Citation Wroblowski, BWigglesworth, MJSzekeres, PGSmith, GDRahman, SSNicholson, NHMuir, AIHall, AHeer, JPGarland, SLCoates, WJ The discovery of a selective, small molecule agonist for the MAS-related gene X1 receptor. J Med Chem52:818-25 (2009) 
 
5-hydroxytryptamine receptor 1B
Name:5-hydroxytryptamine receptor 1B
Type:G Protein-Coupled Receptor (GPCR)
Mol. Mass.:43579.17
Organism:Homo sapiens (Human)
Description:Receptor binding assays were performed using human clone stably expressed in CHO cells
Residue:390
BDBM50412984
NameBDBM50412984
Synonyms:CHEMBL458002
TypeSmall organic molecule
Emp. Form.C29H28ClN5O2
Mol. Mass.514.018
SMILESCc1ccc(Cn2ncc(N3CCNCC3)c(Cl)c2=O)cc1NC(=O)c1ccc(cc1)-c1ccccc1