Reaction Details
Target5-hydroxytryptamine receptor 2C
LigandBDBM50412988
Substrate/Competitorn/a
Meas. Tech.ChEMBL_516615 (CHEMBL991391)
Ki 2818±n/a nM
Citation Wroblowski, BWigglesworth, MJSzekeres, PGSmith, GDRahman, SSNicholson, NHMuir, AIHall, AHeer, JPGarland, SLCoates, WJ The discovery of a selective, small molecule agonist for the MAS-related gene X1 receptor. J Med Chem52:818-25 (2009) 
 
5-hydroxytryptamine receptor 2C
Name:5-hydroxytryptamine receptor 2C
Type:G Protein-Coupled Receptor (GPCR)
Mol. Mass.:51836.79
Organism:Homo sapiens (Human)
Description:P28335
Residue:458
BDBM50412988
NameBDBM50412988
Synonyms:CHEMBL477008
TypeSmall organic molecule
Emp. Form.C29H29N5O2
Mol. Mass.479.5729
SMILESCc1c(Cn2ncc(cc2=O)N2CCNCC2)cccc1NC(=O)c1ccc(cc1)-c1ccccc1