Reaction Details
TargetD(3) dopamine receptor
LigandBDBM50412985
Substrate/Competitorn/a
Meas. Tech.ChEMBL_516620 (CHEMBL991396)
Ki 3548±n/a nM
Citation Wroblowski, BWigglesworth, MJSzekeres, PGSmith, GDRahman, SSNicholson, NHMuir, AIHall, AHeer, JPGarland, SLCoates, WJ The discovery of a selective, small molecule agonist for the MAS-related gene X1 receptor. J Med Chem52:818-25 (2009) 
 
D(3) dopamine receptor
Name:D(3) dopamine receptor
Type:n/a
Mol. Mass.:44243.43
Organism:Homo sapiens (Human)
Description:n/a
Residue:400
BDBM50412985
NameBDBM50412985
Synonyms:CHEMBL458220
TypeSmall organic molecule
Emp. Form.C29H28ClN5O2
Mol. Mass.514.018
SMILESCc1c(Cn2ncc(N3CCNCC3)c(Cl)c2=O)cccc1NC(=O)c1ccc(cc1)-c1ccccc1