Reaction Details
TargetMas-related G-protein coupled receptor member X1
LigandBDBM50413000
Substrate/Competitorn/a
Meas. Tech.ChEMBL_516621 (CHEMBL991397)
EC50 288±n/a nM
Citation Wroblowski, BWigglesworth, MJSzekeres, PGSmith, GDRahman, SSNicholson, NHMuir, AIHall, AHeer, JPGarland, SLCoates, WJ The discovery of a selective, small molecule agonist for the MAS-related gene X1 receptor. J Med Chem52:818-25 (2009) 
 
Mas-related G-protein coupled receptor member X1
Name:Mas-related G-protein coupled receptor member X1
Type:PROTEIN
Mol. Mass.:36253.68
Organism:Homo sapiens (Human)
Description:ChEMBL_516621
Residue:322
BDBM50413000
NameBDBM50413000
Synonyms:CHEMBL451657
TypeSmall organic molecule
Emp. Form.C32H29ClN6O2
Mol. Mass.565.065
SMILESCc1c(Cn2ncc(N3CCNCC3)c(Cl)c2=O)cccc1NC(=O)c1ccc(cc1)-c1cccc2cccnc12