Reaction Details
TargetMas-related G-protein coupled receptor member X1
LigandBDBM50413004
Substrate/Competitorn/a
Meas. Tech.ChEMBL_516621 (CHEMBL991397)
EC50 107±n/a nM
Citation Wroblowski, BWigglesworth, MJSzekeres, PGSmith, GDRahman, SSNicholson, NHMuir, AIHall, AHeer, JPGarland, SLCoates, WJ The discovery of a selective, small molecule agonist for the MAS-related gene X1 receptor. J Med Chem52:818-25 (2009) 
 
Mas-related G-protein coupled receptor member X1
Name:Mas-related G-protein coupled receptor member X1
Type:PROTEIN
Mol. Mass.:36253.68
Organism:Homo sapiens (Human)
Description:ChEMBL_516621
Residue:322
BDBM50413004
NameBDBM50413004
Synonyms:CHEMBL448975
TypeSmall organic molecule
Emp. Form.C31H31ClN6O3
Mol. Mass.571.069
SMILESCOc1ccc(cn1)-c1ccc(cc1)C(=O)Nc1cccc(Cn2ncc(N3C[C@H]4C[C@H]3CN4C)c(Cl)c2=O)c1C