Reaction Details
TargetUrotensin-2 receptor
LigandBDBM50413017
Substrate/Competitorn/a
Meas. Tech.ChEMBL_496755 (CHEMBL1005392)
Kd 19.95±n/a nM
Citation Wang, YWu, ZGuida, BFLawrence, SKNeeb, MJRivero, RADouglas, SAJin, J N-alkyl-5H-pyrido[4,3-b]indol-1-amines and derivatives as novel urotensin-II receptor antagonists. Bioorg Med Chem Lett18:4936-9 (2008) 
 
Urotensin-2 receptor
Name:Urotensin-2 receptor
Type:Enzyme Catalytic Domain
Mol. Mass.:42159.71
Organism:Homo sapiens (Human)
Description:Urotensin-II UTS2R HUMAN::Q9UKP6
Residue:389
BDBM50413017
NameBDBM50413017
Synonyms:CHEMBL500880
TypeSmall organic molecule
Emp. Form.C18H15N3
Mol. Mass.273.3318
SMILESC(Nc1nccc2[nH]c3ccccc3c12)c1ccccc1