Reaction Details
TargetUrotensin-2 receptor
LigandBDBM50413033
Substrate/Competitorn/a
Meas. Tech.ChEMBL_496754 (CHEMBL1005391)
Ki 63.1±n/a nM
Citation Wang, YWu, ZGuida, BFLawrence, SKNeeb, MJRivero, RADouglas, SAJin, J N-alkyl-5H-pyrido[4,3-b]indol-1-amines and derivatives as novel urotensin-II receptor antagonists. Bioorg Med Chem Lett18:4936-9 (2008) 
 
Urotensin-2 receptor
Name:Urotensin-2 receptor
Type:Enzyme Catalytic Domain
Mol. Mass.:42159.71
Organism:Homo sapiens (Human)
Description:Urotensin-II UTS2R HUMAN::Q9UKP6
Residue:389
BDBM50413033
NameBDBM50413033
Synonyms:CHEMBL505353
TypeSmall organic molecule
Emp. Form.C18H23N3
Mol. Mass.281.3953
SMILESCCCCNc1nccc2n(C(C)C)c3ccccc3c12