Reaction Details
TargetUrotensin-2 receptor
LigandBDBM50413037
Substrate/Competitorn/a
Meas. Tech.ChEMBL_496754 (CHEMBL1005391)
Ki 63.1±n/a nM
Citation Wang, YWu, ZGuida, BFLawrence, SKNeeb, MJRivero, RADouglas, SAJin, J N-alkyl-5H-pyrido[4,3-b]indol-1-amines and derivatives as novel urotensin-II receptor antagonists. Bioorg Med Chem Lett18:4936-9 (2008) 
 
Urotensin-2 receptor
Name:Urotensin-2 receptor
Type:Enzyme Catalytic Domain
Mol. Mass.:42159.71
Organism:Homo sapiens (Human)
Description:Urotensin-II UTS2R HUMAN::Q9UKP6
Residue:389
BDBM50413037
NameBDBM50413037
Synonyms:CHEMBL497578
TypeSmall organic molecule
Emp. Form.C16H19N3
Mol. Mass.253.3422
SMILESCCCCNc1ccnc2[nH]c3ccc(C)cc3c12