Reaction Details
Target5-hydroxytryptamine receptor 1A
LigandBDBM50413078
Substrate/Competitorn/a
Meas. Tech.ChEMBL_492738 (CHEMBL938538)
Ki 0.501±n/a nM
Citation Bromidge, SMBertani, BBorriello, MFaedo, SGordon, LJGranci, EHill, MMarshall, HRStasi, LPZucchelli, VMerlo, GVesentini, AWatson, JMZonzini, L 6-[2-(4-Aryl-1-piperazinyl)ethyl]-2H-1,4-benzoxazin-3(4H)-ones: dual-acting 5-HT1 receptor antagonists and serotonin reuptake inhibitors. Bioorg Med Chem Lett18:5653-6 (2008) 
 
5-hydroxytryptamine receptor 1A
Name:5-hydroxytryptamine receptor 1A
Type:n/a
Mol. Mass.:46122.49
Organism:Homo sapiens (Human)
Description:n/a
Residue:422
BDBM50413078
NameBDBM50413078
Synonyms:CHEMBL491839
TypeSmall organic molecule
Emp. Form.C24H29N3O3
Mol. Mass.407.5054
SMILESCC1(C)Cc2cccc(N3CCN(CCc4ccc5OCC(=O)Nc5c4)CC3)c2O1