Reaction Details
Target5-hydroxytryptamine receptor 1A
LigandBDBM50413080
Substrate/Competitorn/a
Meas. Tech.ChEMBL_492738 (CHEMBL938538)
Ki 0.398±n/a nM
Citation Bromidge, SMBertani, BBorriello, MFaedo, SGordon, LJGranci, EHill, MMarshall, HRStasi, LPZucchelli, VMerlo, GVesentini, AWatson, JMZonzini, L 6-[2-(4-Aryl-1-piperazinyl)ethyl]-2H-1,4-benzoxazin-3(4H)-ones: dual-acting 5-HT1 receptor antagonists and serotonin reuptake inhibitors. Bioorg Med Chem Lett18:5653-6 (2008) 
 
5-hydroxytryptamine receptor 1A
Name:5-hydroxytryptamine receptor 1A
Type:n/a
Mol. Mass.:46122.49
Organism:Homo sapiens (Human)
Description:n/a
Residue:422
BDBM50413080
NameBDBM50413080
Synonyms:CHEMBL489195
TypeSmall organic molecule
Emp. Form.C23H25N5O2
Mol. Mass.403.4769
SMILESCc1ncc2c(cccc2n1)N1CCN(CCc2ccc3OCC(=O)Nc3c2)CC1